palissade de verdure
created: 2011-09-01T00:00:00+02:00
modified: 2014-10-14T09:41:40+02:00
status: 1
type: Concept
broader: T96-1193
definition: Clôture de jardin constituée par des arbres de basse-tige, des arbrisseaux ou des arbustes de basse-tige taillés de façon régulière.
in scheme: T96
narrower: T96-1196