saut de loup
created: 2011-09-01T00:00:00+02:00
modified: 2014-10-14T09:44:30+02:00
status: 1
type: Concept
broader: T96-1193
definition: Fossé sec et court placé devant un ahah ou devant une entrée : dans ce dernier cas, le saut-de-loup est franchi par un pont.
in scheme: T96
preferred label: ha-has @en-us