entrée de jardin
created: 2011-09-01T00:00:00+02:00
modified: 2014-10-14T09:32:11+02:00
status: 1
type: Concept
broader: T96-1185
definition: Dégagement ménagé à la limite d'un jardin afin de relier le système de circulation intérieure à une voie de communication extérieure. L'entrée peut présenter des espaces libres et divers systèmes de fermeture. Lorsqu'il y a plusieurs entrées, on distingue les entrées principales et les entrées secondaires.
in scheme: T96