pas japonais
created: 2011-09-01T00:00:00+02:00
modified: 2014-09-30T12:55:51+02:00
status: 1
type: Concept
broad match: cb12301597s
broader: T96-1185
definition: Chemin de jardin régulier ou irrégulier, souvent établi sur une pelouse et constitué de dalles ou de rondelles de bois isolées les unes des autres.
in scheme: T96
preferred label: Japanese paving stones @en-us