station balnéaire
created: 2011-09-01T00:00:00+02:00
modified: 2015-01-07T11:33:57+01:00
status: 1
type: Concept
broader: T96-11
definition: Station de villégiature située en bord de mer ou de lac.
in scheme: T96
preferred label: seaside resorts @en-us