reposoir
created: 2011-09-01T00:00:00+02:00
modified: 2014-11-27T15:23:35+01:00
status: 1
type: Concept
broader: T96-113
definition: Edicule ou meuble en forme d'autel sur lequel on dépose le saint sacrement, une statue ou tout autre objet sacré lors d'une station de procession. Le reposoir peut être situé dans une église ou à l'extérieur.
in scheme: T96
scope note: Voir aussi le Thesaurus des objets mobiliers.