relief artificiel de jardin
created: 2011-09-01T00:00:00+02:00
modified: 2013-04-23T00:00:00+02:00
status: 1
type: Concept
broader: T96-1115
definition: Relief issu de la modification du site naturel par terrassement, régalage et égalisation.
in scheme: T96
narrower: T96-1201
narrower: T96-1202
narrower: T96-1203
narrower: T96-1204
narrower: T96-1205