belvédère de jardin
terme associe: T96-1145
created: 2011-09-01T00:00:00+02:00
modified: 2014-12-31T11:23:18+01:00
status: 1
type: Concept
alternative label: point de vue
broad match: http://vocab.getty.edu/aat/300008024
broader: T96-1200
definition: Terre-plein, parfois gazonné, aménagé sur un point culminant, butte artificielle ou terrasse en terre-plein offrant une vue. Le belvédère de jardin peut être surmonté d'une fabrique (voir fabrique en belvédère) et accueille généralement des sièges de jardin.
in scheme: T96
related: T96-1145
scope note: Ne pas confondre avec belvédère.