montagne artificielle
created: 2011-09-01T00:00:00+02:00
modified: 2014-10-22T12:17:05+02:00
status: 1
type: Concept
broader: T96-1200
definition: Levée de terre adoptant la forme irrégulière d'une montagne. La colline artificielle est de hauteur moindre.
in scheme: T96