terrasse en terre-plein
created: 2011-09-01T00:00:00+02:00
modified: 2014-12-31T11:27:06+01:00
status: 1
type: Concept
broad match: http://data.bnf.fr/ark:/12148/cb119787841
broader: T96-1200
definition: Terre-plein d'une levée de terre maçonnée ou talutée, mettant de niveau un terrain en pente.
in scheme: T96
preferred label: terraces @en-us