vallon artificiel
created: 2011-09-01T00:00:00+02:00
modified: 2014-10-22T12:18:02+02:00
status: 1
type: Concept
broader: T96-1200
definition: Vallon créé artificiellement pour l'ornementation d'un jardin.
in scheme: T96