alignement d'arbres
created: 2011-09-01T00:00:00+02:00
modified: 2014-12-30T16:14:56+01:00
status: 1
type: Concept
broad match: Arbre
broader: T96-1206
definition: Rangée d'arbres. On parle d'alignement discontinu quand les cimes des arbres sont séparées, et d'alignement continu quand elles se rejoignent, effet obtenu par la taille.
in scheme: T96