arbre isolé
created: 2011-09-01T00:00:00+02:00
modified: 2014-12-30T16:16:36+01:00
status: 1
type: Concept
alternative label: arbre de la liberté
broad match: cb11934786x
broader: T96-1206
definition: Arbre (arbrisseau, arbuste) planté à distance d'un couvert et qui participe à la décoration de l’espace par sa forme spécifique.
in scheme: T96
scope note: Ne pas le confondre avec l'arbre détaché qui participe à la composition du couvert dont il est un élément avancé.