bocage de jardin
created: 2011-09-01T00:00:00+02:00
modified: 2014-10-14T10:38:12+02:00
status: 1
type: Concept
broader: T96-1206
definition: Composition de moyennes dimensions constituée de massifs d’arbres et de groupes d'arbres irrégulièrement espacés, reliés par des clairières, de façon à conserver un aspect naturel.
in scheme: T96