groupe d'arbres
created: 2011-09-01T00:00:00+02:00
modified: 2014-12-30T16:25:42+01:00
status: 1
type: Concept
broad match: cb11934786x
broad match: Arbre
broader: T96-1206
definition: Groupe composé d'arbres de haute ou de moyenne futaie plantés à proximité les uns des autres et dont les houppiers s'interpénètrent. Il se distingue du massif d’arbres par un nombre d’individus moins important.
in scheme: T96