découvert de jardin
created: 2011-09-01T00:00:00+02:00
modified: 2013-04-23T00:00:00+02:00
status: 1
type: Concept
broader: T96-1115
definition: Ensemble des parties d'un jardin traitées en surface ou en faible élévation et souvent limitées par une bordure.
in scheme: T96
narrower: T96-1219
narrower: T96-1220
narrower: T96-1221
narrower: T96-1222
narrower: T96-1224
narrower: T96-1230
narrower: T96-1231
narrower: T96-1233
narrower: T96-1234
narrower: T96-1235
narrower: T96-1236
narrower: T96-1237