massif de fleurs
created: 2011-09-01T00:00:00+02:00
modified: 2014-12-30T16:36:13+01:00
status: 1
type: Concept
broader: T96-1218
definition: Pièce découverte de forme variée garnie de fleurs. Le massif peut être de niveau ou légèrement bombé. Il est parfois traité en mosaïculture.
in scheme: T96
narrower: T96-1223
preferred label: flower beds @en-us