parterre de broderie
created: 2011-09-01T00:00:00+02:00
modified: 2014-12-30T16:42:33+01:00
status: 1
type: Concept
broad match: Parterre (jardinage)
broader: T96-1224
definition: Parterre sans compartiments caractérisé par une surface recouverte de terre ou de particules minérales qui forment un fond sur lequel se détachent les motifs de broderie.
in scheme: T96
preferred label: carpet beds @en-us