pelouse
created: 2011-09-01T00:00:00+02:00
modified: 2014-12-30T16:45:50+01:00
status: 1
type: Concept
broader: T96-1218
definition: Surface ou pièce découverte obtenue par ensemencement et constituée de diverses plantes herbacées gazonnantes régulièrement fauchées afin d'obtenir une étendue homogène et rase.
in scheme: T96
preferred label: lawns (landscaped grass) @en-us