vertugadin
created: 2011-09-01T00:00:00+02:00
modified: 2014-09-30T15:06:15+02:00
status: 1
type: Concept
broad match: http://data.bnf.fr/ark:/12148/cb11965436d
broad match: http://vocab.getty.edu/aat/300008889
broader: T96-1231
definition: Pièce de gazon plantée sur une surface concave, cernée en totalité ou en partie par un glacis ou un talus, parfois bordée d'une palissade.
in scheme: T96