planche de jardin
created: 2011-09-01T00:00:00+02:00
modified: 2014-11-18T13:58:58+01:00
status: 1
type: Concept
broad match: http://data.bnf.fr/ark:/12148/cb11965436d
broad match: http://vocab.getty.edu/aat/300008889
broader: T96-1218
definition: Pièce découverte rectangulaire, large d'environ 1,25 m, parfois légèrement bombée.
in scheme: T96