plate-bande de jardin
created: 2011-09-01T00:00:00+02:00
modified: 2014-10-14T10:54:19+02:00
status: 1
type: Concept
broader: T96-1218
definition: Pièce découverte longue et étroite, constituée de gazon, de fleurs ou d'arbustes d'ornement en pleine-terre ou hors-sol.
in scheme: T96