prairie ornementale
created: 2011-09-01T00:00:00+02:00
modified: 2014-12-30T16:51:17+01:00
status: 1
type: Concept
broader: T96-1218
definition: Surface découverte obtenue par ensemencement et constituée de végétaux herbacés que l'on fauche après la période de floraison.
in scheme: T96