rocaille de jardin
created: 2011-09-01T00:00:00+02:00
modified: 2014-12-30T16:52:59+01:00
status: 1
type: Concept
broader: T96-1218
definition: Composition constituée par des végétaux d'ornement plantés entre des blocs de rochers artificiels ou naturels. La rocaille est une composition propre au jardin irrégulier.
in scheme: T96
preferred label: rock gardens @en-us