salle de verdure
created: 2011-09-01T00:00:00+02:00
modified: 2014-12-30T16:55:32+01:00
status: 1
type: Concept
broad match: http://data.bnf.fr/ark:/12148/cb150964724
broad match: http://vocab.getty.edu/aat/300008857
broader: T96-1218
definition: Découvert aménagé dans un bosquet, parfois doté de niches de verdure de formes diverses. Selon sa destination originelle, elle peut être dénommée salon de verdure (salon vert), salle de bal, salle à manger ou manège de verdure.
in scheme: T96