bâtiment conventuel
created: 2011-09-01T00:00:00+02:00
modified: 2014-11-28T14:23:34+01:00
status: 1
type: Concept
alternative label: partie conventuelle
broader: T96-122
definition: Au sein d'un établissement conventuel, bâtiment pouvant regrouper le dortoir commun ou les cellules, le chauffoir, la salle capitulaire, le réfectoire, la grande salle de travail des moines, etc.
in scheme: T96
narrower: T96-124
narrower: T96-125
narrower: T96-126
narrower: T96-127
narrower: T96-128