absidiole
terme associe: T96-132
created: 2011-09-01T00:00:00+02:00
modified: 2015-02-25T11:19:39+01:00
status: 1
type: Concept
broad match: cb11941964n
broader: T96-1242
definition: Petite abside.
in scheme: T96
preferred label: apsidioles @en-us
related: T96-132
scope note: L'absidiole n'est souvent qu'une partie de chapelle : ne pas prendre en compte sa partie dans la définition de l'absidiole.