colonnade
terme associe: T96-1142
created: 2011-09-01T00:00:00+02:00
modified: 2015-02-25T11:37:19+01:00
status: 1
type: Concept
broader: T96-1238
definition: File de colonnes et leur couvrement : la colonnade est formée de travées ou d'arcades.
in scheme: T96
narrower: T96-1255
preferred label: colonnades @en-us
related: T96-1142
scope note: Ne pas confondre avec portique, qui n'est pas nécessairement bordé par une colonnade.