péristyle
created: 2011-09-01T00:00:00+02:00
modified: 2015-02-25T11:42:16+01:00
status: 1
type: Concept
broader: T96-1254
definition: Colonnade à plusieurs retours, sur le périmètre complet ou presque complet d'un bâtiment, d'une cour, d'une place, etc. Elle peut être interne ou externe.
in scheme: T96
preferred label: peristyles (colonnades) @en-us