salle capitulaire
created: 2011-09-01T00:00:00+02:00
modified: 2014-11-28T15:12:31+01:00
status: 1
type: Concept
broader: T96-123
definition: Salle où se réunit le chapitre d'une communauté religieuse.
in scheme: T96
preferred label: chapter house @en-gb
preferred label: chapter houses @en-us
preferred label: sala capitolare @it