hôtellerie
terme associe: T96-279
created: 2011-09-01T00:00:00+02:00
modified: 2014-11-28T14:55:56+01:00
status: 1
type: Concept
broader: T96-122
definition: Partie d'un établissement conventuel réservée à l'hébergement des hôtes.
in scheme: T96
preferred label: guest house @en-gb
preferred label: guesthouses @en-us
preferred label: foresteria @it
related: T96-279
scope note: Ne pas confondre avec hôtel de voyageurs.