pavement
created: 2011-09-01T00:00:00+02:00
modified: 2015-02-25T10:25:18+01:00
status: 1
type: Concept
broader: T96-1310
definition: Aire de pierres, de briques, de carreaux en céramique, en béton, etc., posée sur une couche de support et d'isolement appelée forme.
definition: Voir aussi le Thesaurus des objets mobiliers.
in scheme: T96
preferred label: pavements (surface elements) @en-us