mur de clôture
created: 2011-09-01T00:00:00+02:00
modified: 2015-02-25T16:20:40+01:00
status: 1
type: Concept
broader: T96-1323
definition: Clôture en maçonnerie, en pierre sèche ou en terre.
in scheme: T96
narrow match: http://data.bnf.fr/ark:/12148/cb119401379