mur de soutènement
created: 2011-09-01T00:00:00+02:00
modified: 2015-02-25T16:23:28+01:00
status: 1
type: Concept
broader: T96-1321
definition: Mur servant à contenir la poussée des terres à un changement de niveau du sol. Il est donc enterré sur une de ses faces.
in scheme: T96
preferred label: retaining walls @en-us