chapelle d'église
created: 2011-09-01T00:00:00+02:00
modified: 2014-10-15T17:13:11+02:00
status: 1
type: Concept
broader: T96-132
definition: Pièce ou petit vaisseau contenant ou ayant contenu un autel ou des fonts baptismaux et formant partie constituante d'une église ou d'un édifice civil.
in scheme: T96
narrower: T96-135
narrower: T96-136
narrower: T96-137
preferred label: chapel 2 @en-gb
preferred label: chapels 2 @en-us
preferred label: cappella 2 @it
scope note: Ne pas appeler chapelle un autel secondaire placé directement dans le vaisseau d'une église. Ne pas confondre avec chapelle.