séchoir à maïs
created: 2011-09-01T00:00:00+02:00
modified: 2015-02-26T12:01:16+01:00
status: 1
type: Concept
broader: T96-1343
definition: Partie d'édifice ou édicule destiné au séchage des épis de maïs.
in scheme: T96