séchoir à tabac
created: 2011-09-01T00:00:00+02:00
modified: 2015-02-26T12:06:14+01:00
status: 1
type: Concept
broader: T96-1343
definition: Édifice ou partie d'édifice affecté au séchage des feuilles de tabac. Ce séchage se fait à l'air libre ou au moyen d'appareils permettant d'éliminer l'humidité et la poussière contenues dans le tabac.
in scheme: T96