chapelle funéraire
terme associe: T96-183
created: 2011-09-01T00:00:00+02:00
modified: 2014-09-22T16:20:32+02:00
status: 1
type: Concept
broader: T96-134
definition: Chapelle d'une église ou d'un autre édifice religieux abritant un autel et accueillant un ou plusieurs tombeaux.
in scheme: T96
preferred label: funeral chapel @en-gb
preferred label: sepulchral chapels @en-us
preferred label: cappella signorile @it
related: T96-183
scope note: Ne pas confondre avec tombeau en forme de chapelle, ni avec chapelle des morts.