chevet
created: 2011-09-01T00:00:00+02:00
modified: 2014-10-15T17:14:23+02:00
status: 1
type: Concept
broader: T96-132
definition: Extrémité extérieure de l'église du côté du maître-autel.
in scheme: T96
preferred label: chevets @en-us
scope note: Ne pas confondre avec abside : l'abside du chœur n'est souvent qu'une partie du chevet et il y a des chevets sans abside (chevet plat).