station thermale
terme associe: T96-11
terme associe: T96-383
created: 2011-09-01T00:00:00+02:00
modified: 2014-10-17T14:20:42+02:00
status: 1
type: Concept
alternative label: ville d'eau
broad match: cb11935587z
broader: T96-5
definition: Agglomération consacrée aux activités curatives liées à la présence d’une eau aux propriétés particulières.
in scheme: T96
preferred label: spa @en-gb
preferred label: spas @en-us
related: T96-11
related: T96-383