clôture de choeur
created: 2011-09-01T00:00:00+02:00
modified: 2015-03-09T11:11:12+01:00
status: 1
type: Concept
alternative label: chancel
alternative label: clôture de chœur
broader: T96-132
definition: Ouvrage séparant le chœur liturgique des autres parties de l'église. Dans les églises paléochrétiennes, cette clôture se nomme chancel.
in scheme: T96
narrower: T96-142
narrower: T96-143
preferred label: choir screen @en-gb
preferred label: choir screens @en-us
preferred label: recinto del coro @it
scope note: Voir aussi le Thesaurus des objets mobiliers.