jubé
created: 2011-09-01T00:00:00+02:00
modified: 2015-03-09T11:12:45+01:00
status: 1
type: Concept
broader: T96-141
definition: Clôture monumentale séparant le chœur liturgique de la nef. Il abrite souvent deux petits autels de part et d'autre de l'entrée et porte généralement une plate-forme ou une coursière à laquelle on accède par des escaliers.
in scheme: T96
preferred label: rood screen @en-gb
preferred label: chancel screens @en-us
preferred label: pontile @it
scope note: Voir aussi le Thesaurus des objets mobiliers.