crypte
created: 2011-09-01T00:00:00+02:00
modified: 2014-11-28T15:59:47+01:00
status: 1
type: Concept
broader: T96-132
definition: Espace aménagé sous le sol d'une église, servant généralement de chapelle. La crypte est formée de galeries et non de vaisseaux.
in scheme: T96
preferred label: crypt @en-gb
preferred label: crypts @en-us
preferred label: cripta @it
scope note: Ne pas confondre avec chapelle basse qui n'est pas enterrée.