déambulatoire
created: 2011-09-01T00:00:00+02:00
modified: 2014-10-15T17:29:47+02:00
status: 1
type: Concept
broader: T96-132
definition: Espace de circulation disposé autour du chœur.
in scheme: T96
preferred label: ambulatory (internal) @en-gb
preferred label: ambulatories @en-us
preferred label: deambulatorio @it