massif antérieur
created: 2011-09-01T00:00:00+02:00
modified: 2014-10-15T17:30:38+02:00
status: 1
type: Concept
alternative label: massif occidental
broader: T96-132
definition: Dispositions structurelles situées à l'entrée de la nef, comprenant habituellement des tours, un porche, une tribune.
in scheme: T96
preferred label: westwork @en-gb
preferred label: westworks @en-us
preferred label: corpo occidentale @it
scope note: Le massif antérieur ne fait pas partie de la nef.