niche-crédence
terme associe: T96-1246
terme associe: T96-168
created: 2011-09-01T00:00:00+02:00
modified: 2014-10-15T17:32:23+02:00
status: 1
type: Concept
broader: T96-132
definition: Petite niche placée près de l'autel du côté de l'Épître et destinée à contenir les burettes.
in scheme: T96
preferred label: credence @en-gb
preferred label: tabernacolo @it
related: T96-1246
related: T96-168
scope note: Voir aussi le Thesaurus des objets mobiliers.