village
created: 2011-09-01T00:00:00+02:00
modified: 2015-01-07T11:42:26+01:00
status: 1
type: Concept
broader: T96-5
definition: Agglomération de moins de 2000 habitants, autrefois souvent siège d'une paroisse et essentiellement vouée aux activités agricoles.
definition: Le nombre d’habitants à prendre en compte est celui de la seule partie agglomérée de la commune.
in scheme: T96
preferred label: villages @en-us
preferred label: villaggio @it