tour lanterne
created: 2011-09-01T00:00:00+02:00
modified: 2014-10-15T17:37:02+02:00
status: 1
type: Concept
broader: T96-132
definition: Tour dans-œuvre percée de baies qui éclairent directement l'espace intérieur du bâtiment sur lequel elle est construite. Elle comprend parfois d'autres étages, notamment une chambre des cloches.
in scheme: T96
preferred label: crossing tower @en-gb
preferred label: crossing towers @en-us
preferred label: tiburio + lanterna @it