transept
created: 2011-09-01T00:00:00+02:00
modified: 2014-10-15T17:37:36+02:00
status: 1
type: Concept
broader: T96-132
definition: Corps transversal formant une croix avec le corps longitudinal de l'église. Il n'est pas toujours saillant. @fr-fr
in scheme: T96
preferred label: transepts
preferred label: transetto @it