ville
created: 2011-09-01T00:00:00+02:00
modified: 2015-01-07T11:48:48+01:00
status: 1
type: Concept
alternative label: civitas
broader: T96-5
definition: Agglomération de plus de 2000 habitants, aux fonctions diversifiées (administration, économie, transports, culture, éducation, logement, etc.), en majorité non agricoles. La ville n’est formée que d’une commune.
in scheme: T96
narrower: T96-17
narrower: T96-19
preferred label: town @en-gb
preferred label: cities + towns @en-us
preferred label: città @it
scope note: Le nombre d’habitants à prendre en compte est celui de la seule partie agglomérée de la commune.